{"text_format":"1","workbook":"xlsx","n_sheets":4,"sheets":["User Inputs","Upper and Lower Limits","Sensitivity Analysis","Output - Chart"],"not_rendered":{"charts":2,"images":0,"macros":1,"external_links":0,"defined_names":13,"comments":1,"pivot_tables":0},"unopened":[],"bounds":{"document_bytes":16777216,"sheet_cells":100000,"rows_first":2000,"rows_last":500,"rows_between":2000,"halvings":0,"cell_chars":16384,"cell_head_chars":4096},"cells_cut":0,"cells_raw":0,"read":"whole","date_system":"1900"}

{"sheet":"User Inputs","index":0,"n_rows":16,"n_cols":9,"rows_kept":16,"cut":false,"hidden":false,"merged":[[1,8,1,15],[14,2,14,3],[15,2,15,3],[13,2,13,3],[3,2,3,3],[4,2,4,3],[3,4,3,6],[4,4,4,6],[1,4,1,6],[8,2,8,3],[6,2,6,3],[1,2,1,3],[10,2,10,3],[11,2,11,3],[7,2,7,3]]}
[]
[null,null,"Which access route do you wish to model?  (select drop-down)",null,"e-consult first",null,null,null,{"$f":"'Output - Chart'!$O$2","v":"e-consult first compared to conventional: Impact on primary care workload"}]
[]
[null,null,{"$f":"\"Select the x-axis for the chart (\" &E2 &\" variables in blue)\"","v":"Select the x-axis for the chart (e-consult first variables in blue)"},null,"Phone via e-consult"]
[null,null,{"$f":"\"Select the legend for the chart (\" &E2 &\" variables in blue)\"","v":"Select the legend for the chart (e-consult first variables in blue)"},null,"e-consult supply-related demand"]
[]
[null,null,"Alternative Access Route Variables",null,"e-consult first","telephone first","video first"]
[null,null,"Access rate: % of consultations initially requested in this way",null,1,1,0.9]
[null,null,"Completion rate: % of digital consultations completed without needing a subsequent consultation",null,0.3,0.8,0.65]
[null,null,"n","Phone via e-consult: Of those having a real-time consultation after e-consult, % having phone rather than F2F consultation",0.9]
[null,null,"Consultation Duration: Average time spent by GP on this type of consultation (minutes)",null,4,5,9]
[null,null,"Supply-related demand: % of digital consultations which are additional demand compared with a conventional appointment system",null,0.05,0,0]
[]
[null,null,"Conventional care Variables"]
[null,null,"% of conventional consultations managed by telephone",null,0.14000000000000001]
[null,null,"Duration of face to face consultation (minutes)",null,9]

{"sheet":"Upper and Lower Limits","index":1,"n_rows":25,"n_cols":22,"rows_kept":25,"cut":false,"hidden":true,"merged":[[9,3,9,4],[8,3,8,4],[5,0,5,1],[8,0,8,1],[9,0,9,1],[4,0,4,1],[7,0,7,1],[4,3,4,4],[7,3,7,4],[5,3,5,4]]}
[]
[null,null,null,null,null,null,null,null,null,null,null,null,null,null,null,null,null,null,null,0,1,2]
[null,null,null,null,null,null,"e-consult first",null,null,"Telephone first",null,null,"Video first",null,null,"Conventional (telephone as exception)",null,null,null,{"$f":"MATCH(AltCon_txt,$J$3:$O$3,0)+T2","v":{"$error":"#N/A"}},{"$f":"MATCH(AltCon_txt,$J$3:$O$3,0)+U2","v":{"$error":"#N/A"}},{"$f":"MATCH(AltCon_txt,$J$3:$O$3,0)+V2","v":{"$error":"#N/A"}}]
[null,null,null,null,null,"Row headings for tel/video","base case","lower estimate","upper estimate","base case","lower estimate","upper estimate","base case","lower estimate","upper estimate","base case","lower estimate","upper estimate","Row headings for e-consult","base case","lower estimate","upper estimate"]
["Alt-Con Access rate: % of consultations managed using the new access route",null,"E1/X1","Access Rate",null,{"$f":"\"Tel/video \" &D5","v":"Tel/video Access Rate"},{"$f":"'User Inputs'!E8","v":1},1E-4,1,{"$f":"'User Inputs'!F8","v":1},1E-4,1,{"$f":"'User Inputs'!G8","v":0.9},1E-4,1,{"$f":"'User Inputs'!E15","v":0.14000000000000001},{"$f":"P5","v":0.14000000000000001},{"$f":"Q5","v":0.14000000000000001},"e-consult access rate",{"$f":"IF(AltCon_txt=\"e-consult first\", J5,INDEX($J5:$O5,1,T$3))","v":1},1E-4,1]
["Alt-con completion rate: % of consultations managed in new way without any further assessment",null,"E3/X3","Completion Rate",null,"Tel/video Completion Rate",{"$f":"'User Inputs'!E9","v":0.3},0.1,0.9,{"$f":"'User Inputs'!F9","v":0.8},0.1,0.9,{"$f":"'User Inputs'!G9","v":0.65},0.1,0.9,{"$f":"J6","v":0.8},{"$f":"K6","v":0.1},{"$f":"L6","v":0.9},"e-consult completion rate",0.8,0.1,0.9]
["Of those having a real-time consultation after e-consult, % having phone consultation",null,"(X1)e","Phone via e-consult",null,null,{"$f":"'User Inputs'!E10","v":0.9},0.3,1,null,null,null,null,null,null,null,null,null,{"$f":"D7","v":"Phone via e-consult"}]
["Alt-con time: Average time spent by GP on alternative format",null,"E2/X2","Consultation Duration",null,"Tel/video Consultation Duration",{"$f":"'User Inputs'!E11","v":4},2,5,{"$f":"'User Inputs'!F11","v":5},4,6,{"$f":"'User Inputs'!G11","v":9},6,15,{"$f":"J8","v":5},{"$f":"K8","v":4},{"$f":"L8","v":6},"e-consult consultation duration",{"$f":"IF(AltCon_txt=\"e-consult first\", J8,INDEX($J8:$O8,1,T$3))","v":5},4,6]
["Supply-induced demand: % of alternative form consultations which are new demand",null,"E5/X5","Supply-related demand",null,"Tel/video Supply-related demand",{"$f":"'User Inputs'!E12","v":0.05},-0.1,0.2,{"$f":"'User Inputs'!F12","v":0},-0.1,0.2,{"$f":"'User Inputs'!G12","v":0},-0.1,0.2,0,0,0,"e-consult supply-related demand",0,-0.1,0.2]
["GP F2F time: Average time spent by GP on conventional face to face consultation (minutes)",null,"F1","GP F2F time",null,null,{"$f":"$P10","v":9},{"$f":"$P10","v":9},9,9,9,9,9,9,9,{"$f":"'User Inputs'!E16","v":9},{"$f":"P10","v":9},{"$f":"P10","v":9},null,9,9,9]
[]
[]
[null,null,null,"e-consult first"]
[null,null,null,{"$f":"J3","v":"Telephone first"}]
[null,null,null,{"$f":"M3","v":"Video first"}]
["Named ranges and contents of drop-downs ---->",null,null,null,null,"Default variables","e-consult first","telephone first","video first"]
[null,null,null,"Yes",null,"X1",1,1,0.9]
[null,null,null,"No",null,"X2",0.3,0.8,0.65]
[null,null,null,null,null,"X1(e) ",0.9]
[null,null,null,{"$f":"IF(AltCon_txt=\"e-consult first\",'Upper and Lower Limits'!S5,'Upper and Lower Limits'!F5)","v":"e-consult access rate"},null,"X3",4,5,9]
{"$rows_left_out":6}
{"sheet":"Sensitivity Analysis","index":2,"n_rows":80,"n_cols":67,"rows_kept":80,"cut":false,"hidden":true,"merged":[]}
[]
[]
[]
[]
[]
[null,null,null,null,null,null,null,null,null,null,null,"s=lower estimate",null,null,null,null,null,null,null,null,null,null,"s=lower mid estimate",null,null,null,null,null,null,null,null,null,null,"s=base case estimate",null,null,null,null,null,null,null,null,null,null,"s=upper mid",null,null,null,null,null,null,null,null,null,null,"s=upper"]
[null,null,null,"variable","Alternative Consultation Variables","base case","lower estimate","upper estimate","lower-mid estimate","upper-mid estimate","increment",1,2,3,4,5,6,7,8,9,10,11,1,2,3,4,5,6,7,8,9,10,11,1,2,3,4,5,6,7,8,9,10,11,1,2,3,4,5,6,7,8,9,10,11,1,2,3,4,5,6,7,8,9,10,11,"base case if x"]
["E1","e-consulation access rate","percent",{"$f":"IF(E8=X_axis_txt,\"X\", IF(E8=legend_txt,\"S\",\"\"))","v":""},{"$f":"'Upper and Lower Limits'!S5","v":"e-consult access rate"},{"$f":"'Upper and Lower Limits'!G5","v":1},{"$f":"'Upper and Lower Limits'!H5","v":1E-4},{"$f":"'Upper and Lower Limits'!I5","v":1},{"$f":"$F8-(($F8-$G8)/2)","v":0.50004999999999999},{"$f":"$F8+(($H8-$F8)/2)","v":1},{"$f":"(H8-G8)/10","v":9.9989999999999996E-2},{"$f":"IF($D8=\"X\",($G8+($K8*(L$7-1))),IF($D8=\"S\",($G8),$F8))","v":1},1,1,1,1,1,1,1,1,1,1,{"$f":"IF($D8=\"X\",($G8+($K8*(W$7-1))),IF($D8=\"S\",($I8),$F8))","v":1},1,1,1,1,1,1,1,1,1,1,{"$f":"IF($D8=\"X\",($G8+($K8*(AH$7-1))),IF($D8=\"S\",($F8),$F8))","v":1},1,1,1,1,1,1,1,1,1,1,{"$f":"IF($D8=\"X\",($G8+($K8*(AS$7-1))),IF($D8=\"S\",($J8),$F8))","v":1},1,1,1,1,1,1,1,1,1,1,{"$f":"IF($D8=\"X\",($G8+($K8*(BD$7-1))),IF($D8=\"S\",($H8),$F8))","v":1},1,1,1,1,1,1,1,1,1,1,{"$f":"IF($D8=\"X\",F8,)","v":0}]
["E2","e-consulation completion rate","percent","",{"$f":"'Upper and Lower Limits'!S6","v":"e-consult completion rate"},{"$f":"'Upper and Lower Limits'!G6","v":0.3},{"$f":"'Upper and Lower Limits'!H6","v":0.1},{"$f":"'Upper and Lower Limits'!I6","v":0.9},0.2,0.60000000000000009,0.08,0.3,0.3,0.3,0.3,0.3,0.3,0.3,0.3,0.3,0.3,0.3,0.3,0.3,0.3,0.3,0.3,0.3,0.3,0.3,0.3,0.3,0.3,0.3,0.3,0.3,0.3,0.3,0.3,0.3,0.3,0.3,0.3,0.3,0.3,0.3,0.3,0.3,0.3,0.3,0.3,0.3,0.3,0.3,0.3,0.3,0.3,0.3,0.3,0.3,0.3,0.3,0.3,0.3,0.3,0.3,{"$f":"IF($D9=\"X\",F9,)","v":0}]
["X1(e)",null,"percent","X",{"$f":"'Upper and Lower Limits'!S7","v":"Phone via e-consult"},{"$f":"'Upper and Lower Limits'!G7","v":0.9},{"$f":"'Upper and Lower Limits'!H7","v":0.3},{"$f":"'Upper and Lower Limits'!I7","v":1},0.6,0.95,6.9999999999999993E-2,0.3,0.37,0.43999999999999995,0.51,0.57999999999999996,0.64999999999999991,0.72,0.78999999999999992,0.85999999999999988,0.92999999999999994,1,0.3,0.37,0.43999999999999995,0.51,0.57999999999999996,0.64999999999999991,0.72,0.78999999999999992,0.85999999999999988,0.92999999999999994,1,0.3,0.37,0.43999999999999995,0.51,0.57999999999999996,0.64999999999999991,0.72,0.78999999999999992,0.85999999999999988,0.92999999999999994,1,0.3,0.37,0.43999999999999995,0.51,0.57999999999999996,0.64999999999999991,0.72,0.78999999999999992,0.85999999999999988,0.92999999999999994,1,0.3,0.37,0.43999999999999995,0.51,0.57999999999999996,0.64999999999999991,0.72,0.78999999999999992,0.85999999999999988,0.92999999999999994,1,0.9]
["E3","e-consultation clincian time (mins)","number",{"$f":"IF(E11=X_axis_txt,\"X\", IF(E11=legend_txt,\"S\",\"\"))","v":""},{"$f":"'Upper and Lower Limits'!S8","v":"e-consult consultation duration"},{"$f":"'Upper and Lower Limits'!G8","v":4},{"$f":"'Upper and Lower Limits'!H8","v":2},{"$f":"'Upper and Lower Limits'!I8","v":5},{"$f":"$F11-(($F11-$G11)/2)","v":3},{"$f":"$F11+(($H11-$F11)/2)","v":4.5},{"$f":"(H11-G11)/10","v":0.3},4,4,4,4,4,4,4,4,4,4,4,4,4,4,4,4,4,4,4,4,4,4,4,4,4,4,4,4,4,4,4,4,4,4,4,4,4,4,4,4,4,4,4,4,4,4,4,4,4,4,4,4,4,4,4,{"$f":"IF($D11=\"X\",F11,)","v":0}]
["E4","e-consulation completion rate","percent","S",{"$f":"'Upper and Lower Limits'!S9","v":"e-consult supply-related demand"},{"$f":"'Upper and Lower Limits'!G9","v":0.05},{"$f":"'Upper and Lower Limits'!H9","v":-0.1},{"$f":"'Upper and Lower Limits'!I9","v":0.2},-2.5000000000000008E-2,0.125,3.0000000000000006E-2,-0.1,-0.1,-0.1,-0.1,-0.1,-0.1,-0.1,-0.1,-0.1,-0.1,-0.1,-2.5000000000000008E-2,-2.5000000000000008E-2,-2.5000000000000008E-2,-2.5000000000000008E-2,-2.5000000000000008E-2,-2.5000000000000008E-2,-2.5000000000000008E-2,-2.5000000000000008E-2,-2.5000000000000008E-2,-2.5000000000000008E-2,-2.5000000000000008E-2,0.05,0.05,0.05,0.05,0.05,0.05,0.05,0.05,0.05,0.05,0.05,0.125,0.125,0.125,0.125,0.125,0.125,0.125,0.125,0.125,0.125,0.125,0.2,0.2,0.2,0.2,0.2,0.2,0.2,0.2,0.2,0.2,0.2,0]
["X1","Alt-Con access rate","percent","",{"$f":"'Upper and Lower Limits'!F5","v":"Tel/video Access Rate"},{"$f":"'Upper and Lower Limits'!T5","v":1},{"$f":"'Upper and Lower Limits'!U5","v":1E-4},{"$f":"'Upper and Lower Limits'!V5","v":1},0.50004999999999999,1,9.9989999999999996E-2,1,1,1,1,1,1,1,1,1,1,1,1,1,1,1,1,1,1,1,1,1,1,1,1,1,1,1,1,1,1,1,1,1,1,1,1,1,1,1,1,1,1,1,1,1,1,1,1,1,1,1,1,1,1,1,0]
["X2","Alt-con completion rate","percent","",{"$f":"'Upper and Lower Limits'!F6","v":"Tel/video Completion Rate"},{"$f":"'Upper and Lower Limits'!T6","v":0.8},{"$f":"'Upper and Lower Limits'!U6","v":0.1},{"$f":"'Upper and Lower Limits'!V6","v":0.9},0.45,0.85000000000000009,0.08,0.8,0.8,0.8,0.8,0.8,0.8,0.8,0.8,0.8,0.8,0.8,0.8,0.8,0.8,0.8,0.8,0.8,0.8,0.8,0.8,0.8,0.8,0.8,0.8,0.8,0.8,0.8,0.8,0.8,0.8,0.8,0.8,0.8,0.8,0.8,0.8,0.8,0.8,0.8,0.8,0.8,0.8,0.8,0.8,0.8,0.8,0.8,0.8,0.8,0.8,0.8,0.8,0.8,0.8,0.8,0]
["X3","Alt-con time","number",{"$f":"IF(E15=X_axis_txt,\"X\", IF(E15=legend_txt,\"S\",\"\"))","v":""},{"$f":"'Upper and Lower Limits'!F8","v":"Tel/video Consultation Duration"},{"$f":"'Upper and Lower Limits'!T8","v":5},{"$f":"'Upper and Lower Limits'!U8","v":4},{"$f":"'Upper and Lower Limits'!V8","v":6},{"$f":"$F15-(($F15-$G15)/2)","v":4.5},{"$f":"$F15+(($H15-$F15)/2)","v":5.5},{"$f":"(H15-G15)/10","v":0.2},5,5,5,5,5,5,5,5,5,5,5,5,5,5,5,5,5,5,5,5,5,5,5,5,5,5,5,5,5,5,5,5,5,5,5,5,5,5,5,5,5,5,5,5,5,5,5,5,5,5,5,5,5,5,5,{"$f":"IF($D15=\"X\",F15,)","v":0}]
["X4","Supply induced demand","percent","",{"$f":"'Upper and Lower Limits'!F9","v":"Tel/video Supply-related demand"},{"$f":"'Upper and Lower Limits'!T9","v":0},{"$f":"'Upper and Lower Limits'!U9","v":-0.1},{"$f":"'Upper and Lower Limits'!V9","v":0.2},-0.05,0.1,3.0000000000000006E-2,0,0,0,0,0,0,0,0,0,0,0,0,0,0,0,0,0,0,0,0,0,0,0,0,0,0,0,0,0,0,0,0,0,0,0,0,0,0,0,0,0,0,0,0,0,0,0,0,0,0,0,0,0,0,0,0]
["F1","GP F2F time","number","",{"$f":"'Upper and Lower Limits'!D10","v":"GP F2F time"},{"$f":"'Upper and Lower Limits'!T10","v":9},{"$f":"'Upper and Lower Limits'!U10","v":9},{"$f":"'Upper and Lower Limits'!V10","v":9},9,9,0,9,9,9,9,9,9,9,9,9,9,9,9,9,9,9,9,9,9,9,9,9,9,9,9,9,9,9,9,9,9,9,9,9,9,9,9,9,9,9,9,9,9,9,9,9,9,9,9,9,9,9,9,9,9,9,0]
[null,null,null,null,"digital: supply-induced demand compared with original",{"$f":"1/(1-F12)","v":1.0526315789473684},0.90909090909090906,1.25,0.97560975609756106,1.1428571428571428,1.0309278350515465,{"$f":"1/(1-L12)","v":0.90909090909090906},0.90909090909090906,0.90909090909090906,0.90909090909090906,0.90909090909090906,0.90909090909090906,0.90909090909090906,0.90909090909090906,0.90909090909090906,0.90909090909090906,0.90909090909090906,0.97560975609756106,0.97560975609756106,0.97560975609756106,0.97560975609756106,0.97560975609756106,0.97560975609756106,0.97560975609756106,0.97560975609756106,0.97560975609756106,0.97560975609756106,0.97560975609756106,1.0526315789473684,1.0526315789473684,1.0526315789473684,1.0526315789473684,1.0526315789473684,1.0526315789473684,1.0526315789473684,1.0526315789473684,1.0526315789473684,1.0526315789473684,1.0526315789473684,1.1428571428571428,1.1428571428571428,1.1428571428571428,1.1428571428571428,1.1428571428571428,1.1428571428571428,1.1428571428571428,1.1428571428571428,1.1428571428571428,1.1428571428571428,1.1428571428571428,1.25,1.25,1.25,1.25,1.25,1.25,1.25,1.25,1.25,1.25,1.25]
[null,null,null,null,"tel/video: Supply induced demand compared with original",{"$f":"1/(1-(F16))","v":1},0.90909090909090906,1.25,0.95238095238095233,1.1111111111111112,1.0309278350515465,{"$f":"1/(1-(L16))","v":1},1,1,1,1,1,1,1,1,1,1,1,1,1,1,1,1,1,1,1,1,1,1,1,1,1,1,1,1,1,1,1,1,1,1,1,1,1,1,1,1,1,1,1,1,1,1,1,1,1,1,1,1,1,1,{"$f":"MAX(BO8:BO17)","v":0.9}]
[null,null,null,null,"The is the total additional demand routed into the system at the very beginning"]
{"$rows_left_out":61}
{"sheet":"Output - Chart","index":3,"n_rows":14,"n_cols":15,"rows_kept":14,"cut":false,"hidden":true,"merged":[]}
[]
[null,null,null,null,null,null,null,null,null,null,null,null,null,{"$f":"'User Inputs'!C2","v":"Which access route do you wish to model?  (select drop-down)"},{"$f":"AltCon_txt & \" compared to conventional: Impact on primary care workload\"","v":"e-consult first compared to conventional: Impact on primary care workload"}]
[null,null,null,null,null,null,null,null,null,null,null,null,null,{"$f":"'User Inputs'!C4","v":"Select the x-axis for the chart (e-consult first variables in blue)"},{"$f":"X_axis_txt","v":"Phone via e-consult"}]
[null,null,null,null,null,null,null,null,null,null,null,null,null,{"$f":"'User Inputs'!C5","v":"Select the legend for the chart (e-consult first variables in blue)"},{"$f":"legend_txt","v":"e-consult supply-related demand"}]
[null,null,null,null,null,null,null,null,null,null,null,null,null,"Y axis variable","Workload compared to conventional care"]
[null,null,null,null,null,null,null,null,null,null,null,null,null,"Workload compared to conventional care, value",{"$f":"'Sensitivity Analysis'!F61","v":7.9516554847772758E-2}]
[]
[]
[]
[]
[]
[]
[null,null,null,null,null,null,null,null,null,null,null,null,null,"base case variable and value"]
[null,null,null,null,null,null,null,null,null,null,null,null,null,{"$f":"O3","v":"Phone via e-consult"},{"$f":"'Sensitivity Analysis'!BO19","v":0.9}]